Reaction Details
TargetKappa-type opioid receptor
LigandBDBM50377004
Substrate/Competitorn/a
Meas. Tech.ChEMBL_479227 (CHEMBL927001)
EC50 6±n/a nM
Citation Kumar, VGuo, DMarella, MCassel, JADehaven, RNDaubert, JDMansson, E Use of receptor chimeras to identify small molecules with high affinity for the dynorphin A binding domain of the kappa opioid receptor. Bioorg Med Chem Lett18:3667-71 (2008) 
 
Kappa-type opioid receptor
Name:Kappa-type opioid receptor
Type:G Protein-Coupled Receptor (GPCR)
Mol. Mass.:42648.76
Organism:Homo sapiens (Human)
Description:P41145
Residue:380
BDBM50377004
NameBDBM50377004
Synonyms:CHEMBL258172
TypeSmall organic molecule
Emp. Form.C23H30N2O3
Mol. Mass.382.4959
SMILESCOc1ccc(CC(=O)N(C)[C@H](CN2CCCC2)c2ccccc2)cc1OC