Reaction Details
TargetC-C chemokine receptor type 2
LigandBDBM50239941
Substrate/Competitorn/a
Meas. Tech.ChEMBL_479245 (CHEMBL932555)
IC50 2.4±n/a nM
Citation Xia, MHou, CDemong, DPollack, SPan, MBrackley, JSinger, MMatheis, MCavender, DWachter, M Substituted dipiperidine alcohols as potent CCR2 antagonists. Bioorg Med Chem Lett18:3562-4 (2008) 
 
C-C chemokine receptor type 2
Name:C-C chemokine receptor type 2
Type:Enzyme
Mol. Mass.:41932.32
Organism:Homo sapiens (Human)
Description:P41597
Residue:374
BDBM50239941
NameBDBM50239941
Synonyms:(S)-1-(4-(1-(4-(1H-indol-3-yl)piperidin-1-yl)-2-hydroxyethyl)piperidin-1-yl)-3-(3,4,5-trifluorophenyl)prop-2-en-1-one | CHEMBL254355
TypeSmall organic molecule
Emp. Form.C29H32F3N3O2
Mol. Mass.511.5785
SMILESOC[C@H](C1CCN(CC1)C(=O)\C=C\c1cc(F)c(F)c(F)c1)N1CCC(CC1)c1c[nH]c2ccccc12