Reaction Details
TargetC-C chemokine receptor type 2
LigandBDBM50377026
Substrate/Competitorn/a
Meas. Tech.ChEMBL_479245 (CHEMBL932555)
IC50 1±n/a nM
Citation Xia, MHou, CDemong, DPollack, SPan, MBrackley, JSinger, MMatheis, MCavender, DWachter, M Substituted dipiperidine alcohols as potent CCR2 antagonists. Bioorg Med Chem Lett18:3562-4 (2008) 
 
C-C chemokine receptor type 2
Name:C-C chemokine receptor type 2
Type:Enzyme
Mol. Mass.:41932.32
Organism:Homo sapiens (Human)
Description:P41597
Residue:374
BDBM50377026
NameBDBM50377026
Synonyms:CHEMBL254772
TypeSmall organic molecule
Emp. Form.C30H35F3N4O4S
Mol. Mass.604.684
SMILESCS(=O)(=O)Nc1ccc2[nH]cc(C3CCN(CC3)C(CO)C3CCN(CC3)C(=O)\C=C\c3cc(F)c(F)c(F)c3)c2c1