Reaction Details
TargetC-C chemokine receptor type 2
LigandBDBM50377029
Substrate/Competitorn/a
Meas. Tech.ChEMBL_479245 (CHEMBL932555)
IC50 6±n/a nM
Citation Xia, MHou, CDemong, DPollack, SPan, MBrackley, JSinger, MMatheis, MCavender, DWachter, M Substituted dipiperidine alcohols as potent CCR2 antagonists. Bioorg Med Chem Lett18:3562-4 (2008) 
 
C-C chemokine receptor type 2
Name:C-C chemokine receptor type 2
Type:Enzyme
Mol. Mass.:41932.32
Organism:Homo sapiens (Human)
Description:P41597
Residue:374
BDBM50377029
NameBDBM50377029
Synonyms:CHEMBL255499
TypeSmall organic molecule
Emp. Form.C30H34F3N3O3
Mol. Mass.541.6045
SMILESCOc1ccc2[nH]cc(C3CCN(CC3)C(CO)C3CCN(CC3)C(=O)\C=C\c3cc(F)c(F)c(F)c3)c2c1