Reaction Details
TargetC-C chemokine receptor type 2
LigandBDBM50377034
Substrate/Competitorn/a
Meas. Tech.ChEMBL_479245 (CHEMBL932555)
IC50 0.6±n/a nM
Citation Xia, MHou, CDemong, DPollack, SPan, MBrackley, JSinger, MMatheis, MCavender, DWachter, M Substituted dipiperidine alcohols as potent CCR2 antagonists. Bioorg Med Chem Lett18:3562-4 (2008) 
 
C-C chemokine receptor type 2
Name:C-C chemokine receptor type 2
Type:Enzyme
Mol. Mass.:41932.32
Organism:Homo sapiens (Human)
Description:P41597
Residue:374
BDBM50377034
NameBDBM50377034
Synonyms:CHEMBL256301
TypeSmall organic molecule
Emp. Form.C30H36Cl2N4O4S
Mol. Mass.619.602
SMILESCS(=O)(=O)Nc1ccc2[nH]cc(C3CCN(CC3)C(CO)C3CCN(CC3)C(=O)\C=C\c3ccc(Cl)c(Cl)c3)c2c1