Reaction Details
TargetC-C chemokine receptor type 2
LigandBDBM50377041
Substrate/Competitorn/a
Meas. Tech.ChEMBL_479245 (CHEMBL932555)
IC50 6±n/a nM
Citation Xia, MHou, CDemong, DPollack, SPan, MBrackley, JSinger, MMatheis, MCavender, DWachter, M Substituted dipiperidine alcohols as potent CCR2 antagonists. Bioorg Med Chem Lett18:3562-4 (2008) 
 
C-C chemokine receptor type 2
Name:C-C chemokine receptor type 2
Type:Enzyme
Mol. Mass.:41932.32
Organism:Homo sapiens (Human)
Description:P41597
Residue:374
BDBM50377041
NameBDBM50377041
Synonyms:CHEMBL257173
TypeSmall organic molecule
Emp. Form.C29H33F2N3O2
Mol. Mass.493.588
SMILESOCC(C1CCN(CC1)C(=O)\C=C\c1ccc(F)c(F)c1)N1CCC(CC1)c1c[nH]c2ccccc12