Reaction Details
TargetNeuronal acetylcholine receptor subunit alpha-7
LigandBDBM50161764
Substrate/Competitorn/a
Meas. Tech.ChEMBL_479250 (CHEMBL932560)
Ki 24±n/a nM
Citation Acker, BAJacobsen, EJRogers, BNWishka, DGReitz, SCPiotrowski, DWMyers, JKWolfe, MLGroppi, VEThornburgh, BATinholt, PMWalters, RROlson, BAFitzgerald, LStaton, BARaub, TJKrause, MLi, KSHoffmann, WEHajos, MHurst, RSWalker, DP Discovery of N-[(3R,5R)-1-azabicyclo[3.2.1]oct-3-yl]furo[2,3-c]pyridine-5-carboxamide as an agonist of the alpha7 nicotinic acetylcholine receptor: in vitro and in vivo activity. Bioorg Med Chem Lett18:3611-5 (2008) 
 
Neuronal acetylcholine receptor subunit alpha-7
Name:Neuronal acetylcholine receptor subunit alpha-7
Type:Enzyme
Mol. Mass.:56502.44
Organism:Rattus norvegicus (Rat)
Description:Q05941
Residue:502
BDBM50161764
NameBDBM50161764
Synonyms:(R)-4-chloro-N-(quinuclidin-3-yl)benzamide CHEMBL177611 PNU-282987 | PNU282987
TypeSmall organic molecule
Emp. Form.C14H17ClN2O
Mol. Mass.264.751
SMILESClc1ccc(cc1)C(=O)N[C@H]1CN2CCC1CC2