Reaction Details
TargetNeuronal acetylcholine receptor subunit alpha-7
LigandBDBM50377053
Substrate/Competitorn/a
Meas. Tech.ChEMBL_479250 (CHEMBL932560)
Ki 21±n/a nM
Citation Acker, BAJacobsen, EJRogers, BNWishka, DGReitz, SCPiotrowski, DWMyers, JKWolfe, MLGroppi, VEThornburgh, BATinholt, PMWalters, RROlson, BAFitzgerald, LStaton, BARaub, TJKrause, MLi, KSHoffmann, WEHajos, MHurst, RSWalker, DP Discovery of N-[(3R,5R)-1-azabicyclo[3.2.1]oct-3-yl]furo[2,3-c]pyridine-5-carboxamide as an agonist of the alpha7 nicotinic acetylcholine receptor: in vitro and in vivo activity. Bioorg Med Chem Lett18:3611-5 (2008) 
 
Neuronal acetylcholine receptor subunit alpha-7
Name:Neuronal acetylcholine receptor subunit alpha-7
Type:Enzyme
Mol. Mass.:56502.44
Organism:Rattus norvegicus (Rat)
Description:Q05941
Residue:502
BDBM50377053
NameBDBM50377053
Synonyms:CHEMBL258239
TypeSmall organic molecule
Emp. Form.C15H17N3OS
Mol. Mass.287.38
SMILESO=C(N[C@@H]1C[C@H]2CCN(C2)C1)c1ccc2ncsc2c1