Reaction Details
Target5-hydroxytryptamine receptor 3A
LigandBDBM50190786
Substrate/Competitorn/a
Meas. Tech.ChEMBL_479255 (CHEMBL932565)
Ki 630±n/a nM
Citation Acker, BAJacobsen, EJRogers, BNWishka, DGReitz, SCPiotrowski, DWMyers, JKWolfe, MLGroppi, VEThornburgh, BATinholt, PMWalters, RROlson, BAFitzgerald, LStaton, BARaub, TJKrause, MLi, KSHoffmann, WEHajos, MHurst, RSWalker, DP Discovery of N-[(3R,5R)-1-azabicyclo[3.2.1]oct-3-yl]furo[2,3-c]pyridine-5-carboxamide as an agonist of the alpha7 nicotinic acetylcholine receptor: in vitro and in vivo activity. Bioorg Med Chem Lett18:3611-5 (2008) 
 
5-hydroxytryptamine receptor 3A
Name:5-hydroxytryptamine receptor 3A
Type:Enzyme Catalytic Domain
Mol. Mass.:55428.70
Organism:RAT
Description:5-HT3 HTR3A RAT::P35563
Residue:483
BDBM50190786
NameBDBM50190786
Synonyms:(R)-N-(quinuclidin-3-yl)furo[2,3-c]pyridine-5-carboxamide N-[(3R)-1-azabicyclo[2.2.2]oct-3-yl]furo[2,3-c]pyridine-5-carboxamide PHA543613
TypeSmall organic molecule
Emp. Form.C15H17N3O2
Mol. Mass.271.3144
SMILESO=C(N[C@H]1CN2CCC1CC2)c1cc2ccoc2cn1