Reaction Details
TargetNeuronal acetylcholine receptor subunit alpha-7
LigandBDBM50377050
Substrate/Competitorn/a
Meas. Tech.ChEMBL_479263 (CHEMBL932573)
Ki 9±n/a nM
Citation Acker, BAJacobsen, EJRogers, BNWishka, DGReitz, SCPiotrowski, DWMyers, JKWolfe, MLGroppi, VEThornburgh, BATinholt, PMWalters, RROlson, BAFitzgerald, LStaton, BARaub, TJKrause, MLi, KSHoffmann, WEHajos, MHurst, RSWalker, DP Discovery of N-[(3R,5R)-1-azabicyclo[3.2.1]oct-3-yl]furo[2,3-c]pyridine-5-carboxamide as an agonist of the alpha7 nicotinic acetylcholine receptor: in vitro and in vivo activity. Bioorg Med Chem Lett18:3611-5 (2008) 
 
Neuronal acetylcholine receptor subunit alpha-7
Name:Neuronal acetylcholine receptor subunit alpha-7
Type:n/a
Mol. Mass.:56448.33
Organism:Homo sapiens (Human)
Description: CHRNA7 (NACHRA7)
Residue:502
BDBM50377050
NameBDBM50377050
Synonyms:CHEMBL403858 | PH-709829
TypeSmall organic molecule
Emp. Form.C15H17N3O2
Mol. Mass.271.3144
SMILESO=C(N[C@@H]1C[C@H]2CCN(C2)C1)c1cc2ccoc2cn1