Reaction Details
TargetMacrophage colony-stimulating factor 1 receptor
LigandBDBM50377072
Substrate/Competitorn/a
Meas. Tech.ChEMBL_479297 (CHEMBL933669)
IC50 0.3±n/a nM
Citation Meegalla, SKWall, MJChen, JWilson, KJBallentine, SKDesjarlais, RLSchubert, CCrysler, CSChen, YMolloy, CJChaikin, MAManthey, CLPlayer, MRTomczuk, BEIllig, CR Structure-based optimization of a potent class of arylamide FMS inhibitors. Bioorg Med Chem Lett18:3632-7 (2008) 
 
Macrophage colony-stimulating factor 1 receptor
Name:Macrophage colony-stimulating factor 1 receptor
Type:Protein
Mol. Mass.:107979.48
Organism:Homo sapiens (Human)
Description:P07333
Residue:972
BDBM50377072
NameBDBM50377072
Synonyms:CHEMBL438533
TypeSmall organic molecule
Emp. Form.C23H28N4O2
Mol. Mass.392.494
SMILESCC1CCN(CC1)c1cc(ccc1NC(=O)c1ccc(o1)C#N)C1CCNCC1