Reaction Details
TargetInhibitor of nuclear factor kappa-B kinase subunit beta
LigandBDBM50377130
Substrate/Competitorn/a
Meas. Tech.ChEMBL_479333 (CHEMBL921616)
IC50 540±n/a nM
Citation Bingham, AHDavenport, RJFosbeary, RGowers, LKnight, RLLowe, COwen, DAParry, DMPitt, WR Synthesis and structure-activity relationship of aminopyrimidine IKK2 inhibitors. Bioorg Med Chem Lett18:3622-7 (2008) 
 
Inhibitor of nuclear factor kappa-B kinase subunit beta
Name:Inhibitor of nuclear factor kappa-B kinase subunit beta
Type:Serine/threonine-protein kinase
Mol. Mass.:86554.39
Organism:Homo sapiens (Human)
Description:GST-tagged IKK-2 was expressed in High Five cells and purified.
Residue:756
BDBM50377130
NameBDBM50377130
Synonyms:CHEMBL256523
TypeSmall organic molecule
Emp. Form.C21H19N5O2S2
Mol. Mass.437.538
SMILESO=S(=O)(N1CCCC1)c1ccc(cc1)-c1ccnc(Nc2ccc3ncsc3c2)n1