Reaction Details
TargetInhibitor of nuclear factor kappa-B kinase subunit beta
LigandBDBM50377133
Substrate/Competitorn/a
Meas. Tech.ChEMBL_479333 (CHEMBL921616)
IC50 250±n/a nM
Citation Bingham, AHDavenport, RJFosbeary, RGowers, LKnight, RLLowe, COwen, DAParry, DMPitt, WR Synthesis and structure-activity relationship of aminopyrimidine IKK2 inhibitors. Bioorg Med Chem Lett18:3622-7 (2008) 
 
Inhibitor of nuclear factor kappa-B kinase subunit beta
Name:Inhibitor of nuclear factor kappa-B kinase subunit beta
Type:Serine/threonine-protein kinase
Mol. Mass.:86554.39
Organism:Homo sapiens (Human)
Description:GST-tagged IKK-2 was expressed in High Five cells and purified.
Residue:756
BDBM50377133
NameBDBM50377133
Synonyms:CHEMBL257402
TypeSmall organic molecule
Emp. Form.C21H19N5O2S3
Mol. Mass.469.603
SMILESO=S(=O)(N1CCSCC1)c1ccc(cc1)-c1ccnc(Nc2ccc3ncsc3c2)n1