Reaction Details
TargetInhibitor of nuclear factor kappa-B kinase subunit beta
LigandBDBM50377146
Substrate/Competitorn/a
Meas. Tech.ChEMBL_479333 (CHEMBL921616)
IC50 700±n/a nM
Citation Bingham, AHDavenport, RJFosbeary, RGowers, LKnight, RLLowe, COwen, DAParry, DMPitt, WR Synthesis and structure-activity relationship of aminopyrimidine IKK2 inhibitors. Bioorg Med Chem Lett18:3622-7 (2008) 
 
Inhibitor of nuclear factor kappa-B kinase subunit beta
Name:Inhibitor of nuclear factor kappa-B kinase subunit beta
Type:Serine/threonine-protein kinase
Mol. Mass.:86554.39
Organism:Homo sapiens (Human)
Description:GST-tagged IKK-2 was expressed in High Five cells and purified.
Residue:756
BDBM50377146
NameBDBM50377146
Synonyms:CHEMBL428424
TypeSmall organic molecule
Emp. Form.C20H14N6S
Mol. Mass.370.43
SMILESN(c1ccc2ncsc2c1)c1nccc(n1)-c1ccc(cc1)-n1ccnc1