Reaction Details
TargetInhibitor of nuclear factor kappa-B kinase subunit alpha
LigandBDBM50377140
Substrate/Competitorn/a
Meas. Tech.ChEMBL_479334 (CHEMBL921617)
IC50 731±n/a nM
Citation Bingham, AHDavenport, RJFosbeary, RGowers, LKnight, RLLowe, COwen, DAParry, DMPitt, WR Synthesis and structure-activity relationship of aminopyrimidine IKK2 inhibitors. Bioorg Med Chem Lett18:3622-7 (2008) 
 
Inhibitor of nuclear factor kappa-B kinase subunit alpha
Name:Inhibitor of nuclear factor kappa-B kinase subunit alpha
Type:PROTEIN
Mol. Mass.:84642.21
Organism:Homo sapiens (Human)
Description:ChEMBL_327453
Residue:745
BDBM50377140
NameBDBM50377140
Synonyms:CHEMBL254793
TypeSmall organic molecule
Emp. Form.C20H18N6OS
Mol. Mass.390.462
SMILESNCCC(=O)Nc1ccc(cc1)-c1ccnc(Nc2ccc3ncsc3c2)n1