Reaction Details
TargetInterleukin-1 receptor-associated kinase 4
LigandBDBM50377163
Substrate/Competitorn/a
Meas. Tech.ChEMBL_479339 (CHEMBL921622)
IC50 5±n/a nM
Citation Buckley, GMFosbeary, RFraser, JLGowers, LHigueruelo, APJames, LAJenkins, KMack, SRMorgan, TParry, DMPitt, WRRausch, ORichard, MDSabin, V IRAK-4 inhibitors. Part III: a series of imidazo[1,2-a]pyridines. Bioorg Med Chem Lett18:3656-60 (2008) 
 
Interleukin-1 receptor-associated kinase 4
Name:Interleukin-1 receptor-associated kinase 4
Type:Protein
Mol. Mass.:51519.08
Organism:Homo sapiens (Human)
Description:Q9NWZ3
Residue:460
BDBM50377163
NameBDBM50377163
Synonyms:CHEMBL403358
TypeSmall organic molecule
Emp. Form.C18H20N6O
Mol. Mass.336.391
SMILESNC(=O)c1ccc2ncc(-c3cccc(NC4CCNCC4)n3)n2c1