Reaction Details
TargetUrotensin-2 receptor
LigandBDBM50377223
Substrate/Competitorn/a
Meas. Tech.ChEMBL_479361 (CHEMBL921644)
Ki 6±n/a nM
Citation McAtee, JJDodson, JWDowdell, SEGirard, GRGoodman, KBHilfiker, MASehon, CASha, DWang, GZWang, NViet, AQZhang, DAiyar, NVBehm, DJCarballo, LHEvans, CAFries, HENagilla, RRoethke, TJXu, XYuan, CCDouglas, SANeeb, MJ Development of potent and selective small-molecule human Urotensin-II antagonists. Bioorg Med Chem Lett18:3500-3 (2008) 
 
Urotensin-2 receptor
Name:Urotensin-2 receptor
Type:Enzyme Catalytic Domain
Mol. Mass.:42159.71
Organism:Homo sapiens (Human)
Description:Urotensin-II UTS2R HUMAN::Q9UKP6
Residue:389
BDBM50377223
NameBDBM50377223
Synonyms:CHEMBL258251
TypeSmall organic molecule
Emp. Form.C26H30Cl2N4O2
Mol. Mass.501.448
SMILESClc1ccc(cc1Cl)N(CC#N)CC(=O)N1CCCC(C1CN1CCOCC1)c1ccccc1