Reaction Details
TargetCytochrome P450 2D6
LigandBDBM50377226
Substrate/Competitorn/a
Meas. Tech.ChEMBL_479363 (CHEMBL921646)
IC50 8000±n/a nM
Citation McAtee, JJDodson, JWDowdell, SEGirard, GRGoodman, KBHilfiker, MASehon, CASha, DWang, GZWang, NViet, AQZhang, DAiyar, NVBehm, DJCarballo, LHEvans, CAFries, HENagilla, RRoethke, TJXu, XYuan, CCDouglas, SANeeb, MJ Development of potent and selective small-molecule human Urotensin-II antagonists. Bioorg Med Chem Lett18:3500-3 (2008) 
 
Cytochrome P450 2D6
Name:Cytochrome P450 2D6
Type:Protein
Mol. Mass.:55774.82
Organism:Homo sapiens (Human)
Description:P10635
Residue:497
BDBM50377226
NameBDBM50377226
Synonyms:CHEMBL255460
TypeSmall organic molecule
Emp. Form.C25H28ClN3O3S
Mol. Mass.486.026
SMILESClc1ccc2sc(=O)n(CC(=O)N3CCCC(C3CN3CCOCC3)c3ccccc3)c2c1