Reaction Details
TargetCytochrome P450 2D6
LigandBDBM50377224
Substrate/Competitorn/a
Meas. Tech.ChEMBL_479363 (CHEMBL921646)
IC50 2300±n/a nM
Citation McAtee, JJDodson, JWDowdell, SEGirard, GRGoodman, KBHilfiker, MASehon, CASha, DWang, GZWang, NViet, AQZhang, DAiyar, NVBehm, DJCarballo, LHEvans, CAFries, HENagilla, RRoethke, TJXu, XYuan, CCDouglas, SANeeb, MJ Development of potent and selective small-molecule human Urotensin-II antagonists. Bioorg Med Chem Lett18:3500-3 (2008) 
 
Cytochrome P450 2D6
Name:Cytochrome P450 2D6
Type:Protein
Mol. Mass.:55774.82
Organism:Homo sapiens (Human)
Description:P10635
Residue:497
BDBM50377224
NameBDBM50377224
Synonyms:CHEMBL257767
TypeSmall organic molecule
Emp. Form.C26H30Cl2N4O
Mol. Mass.485.449
SMILESClc1ccc(cc1Cl)N(CC#N)CC(=O)N1CCCC(C1CN1CCCC1)c1ccccc1