Reaction Details
TargetCytochrome P450 3A4
LigandBDBM50377215
Substrate/Competitorn/a
Meas. Tech.ChEMBL_479364 (CHEMBL921647)
IC50 6800±n/a nM
Citation McAtee, JJDodson, JWDowdell, SEGirard, GRGoodman, KBHilfiker, MASehon, CASha, DWang, GZWang, NViet, AQZhang, DAiyar, NVBehm, DJCarballo, LHEvans, CAFries, HENagilla, RRoethke, TJXu, XYuan, CCDouglas, SANeeb, MJ Development of potent and selective small-molecule human Urotensin-II antagonists. Bioorg Med Chem Lett18:3500-3 (2008) 
 
Cytochrome P450 3A4
Name:Cytochrome P450 3A4
Type:Enzyme
Mol. Mass.:57349.57
Organism:Homo sapiens (Human)
Description:n/a
Residue:503
BDBM50377215
NameBDBM50377215
Synonyms:CHEMBL257415
TypeSmall organic molecule
Emp. Form.C28H34N4O2
Mol. Mass.458.5952
SMILESCc1cc2ncc(=O)n(CC(=O)N3CCCC(C3CN3CCCC3)c3ccccc3)c2cc1C