Reaction Details
TargetKappa-type opioid receptor
LigandBDBM50377227
Substrate/Competitorn/a
Meas. Tech.ChEMBL_479369 (CHEMBL921652)
EC50 1300±n/a nM
Citation McAtee, JJDodson, JWDowdell, SEGirard, GRGoodman, KBHilfiker, MASehon, CASha, DWang, GZWang, NViet, AQZhang, DAiyar, NVBehm, DJCarballo, LHEvans, CAFries, HENagilla, RRoethke, TJXu, XYuan, CCDouglas, SANeeb, MJ Development of potent and selective small-molecule human Urotensin-II antagonists. Bioorg Med Chem Lett18:3500-3 (2008) 
 
Kappa-type opioid receptor
Name:Kappa-type opioid receptor
Type:G Protein-Coupled Receptor (GPCR)
Mol. Mass.:42648.76
Organism:Homo sapiens (Human)
Description:P41145
Residue:380
BDBM50377227
NameBDBM50377227
Synonyms:CHEMBL255462
TypeSmall organic molecule
Emp. Form.C25H28ClN3O2S
Mol. Mass.470.027
SMILESClc1ccc2sc(=O)n(CC(=O)N3CCCC(C3CN3CCCC3)c3ccccc3)c2c1