Reaction Details
TargetKappa-type opioid receptor
LigandBDBM50377219
Substrate/Competitorn/a
Meas. Tech.ChEMBL_479369 (CHEMBL921652)
EC50 7900±n/a nM
Citation McAtee, JJDodson, JWDowdell, SEGirard, GRGoodman, KBHilfiker, MASehon, CASha, DWang, GZWang, NViet, AQZhang, DAiyar, NVBehm, DJCarballo, LHEvans, CAFries, HENagilla, RRoethke, TJXu, XYuan, CCDouglas, SANeeb, MJ Development of potent and selective small-molecule human Urotensin-II antagonists. Bioorg Med Chem Lett18:3500-3 (2008) 
 
Kappa-type opioid receptor
Name:Kappa-type opioid receptor
Type:G Protein-Coupled Receptor (GPCR)
Mol. Mass.:42648.76
Organism:Homo sapiens (Human)
Description:P41145
Residue:380
BDBM50377219
NameBDBM50377219
Synonyms:CHEMBL402520
TypeSmall organic molecule
Emp. Form.C26H29Cl2N3O4
Mol. Mass.518.432
SMILESClc1cc2OCC(=O)N(CC(=O)N3CCCC(C3CN3CCOCC3)c3ccccc3)c2cc1Cl