Reaction Details
TargetKappa-type opioid receptor
LigandBDBM50377222
Substrate/Competitorn/a
Meas. Tech.ChEMBL_479369 (CHEMBL921652)
EC50 1000±n/a nM
Citation McAtee, JJDodson, JWDowdell, SEGirard, GRGoodman, KBHilfiker, MASehon, CASha, DWang, GZWang, NViet, AQZhang, DAiyar, NVBehm, DJCarballo, LHEvans, CAFries, HENagilla, RRoethke, TJXu, XYuan, CCDouglas, SANeeb, MJ Development of potent and selective small-molecule human Urotensin-II antagonists. Bioorg Med Chem Lett18:3500-3 (2008) 
 
Kappa-type opioid receptor
Name:Kappa-type opioid receptor
Type:G Protein-Coupled Receptor (GPCR)
Mol. Mass.:42648.76
Organism:Homo sapiens (Human)
Description:P41145
Residue:380
BDBM50377222
NameBDBM50377222
Synonyms:CHEMBL256937
TypeSmall organic molecule
Emp. Form.C27H35Cl2N3O2
Mol. Mass.504.492
SMILESCOCCN(CC(=O)N1CCCC(C1CN1CCCC1)c1ccccc1)c1ccc(Cl)c(Cl)c1