Reaction Details
TargetKappa-type opioid receptor
LigandBDBM50240153
Substrate/Competitorn/a
Meas. Tech.ChEMBL_479369 (CHEMBL921652)
EC50 3200±n/a nM
Citation McAtee, JJDodson, JWDowdell, SEGirard, GRGoodman, KBHilfiker, MASehon, CASha, DWang, GZWang, NViet, AQZhang, DAiyar, NVBehm, DJCarballo, LHEvans, CAFries, HENagilla, RRoethke, TJXu, XYuan, CCDouglas, SANeeb, MJ Development of potent and selective small-molecule human Urotensin-II antagonists. Bioorg Med Chem Lett18:3500-3 (2008) 
 
Kappa-type opioid receptor
Name:Kappa-type opioid receptor
Type:G Protein-Coupled Receptor (GPCR)
Mol. Mass.:42648.76
Organism:Homo sapiens (Human)
Description:P41145
Residue:380
BDBM50240153
NameBDBM50240153
Synonyms:(+/-)-2-((3,4-dichlorophenyl)(methyl)amino)-1-(3-phenyl-2-(pyrrolidin-1-ylmethyl)piperidin-1-yl)ethanone rac-2-((3,4-dichlorophenyl)(methyl)amino)-1-(3-phenyl-2-(pyrrolidin-1-ylmethyl)piperidin-1-yl)ethanone
TypeSmall organic molecule
Emp. Form.C25H31Cl2N3O
Mol. Mass.460.439
SMILESCN(CC(=O)N1CCCC(C1CN1CCCC1)c1ccccc1)c1ccc(Cl)c(Cl)c1