Reaction Details
TargetKappa-type opioid receptor
LigandBDBM50377220
Substrate/Competitorn/a
Meas. Tech.ChEMBL_479369 (CHEMBL921652)
EC50 500±n/a nM
Citation McAtee, JJDodson, JWDowdell, SEGirard, GRGoodman, KBHilfiker, MASehon, CASha, DWang, GZWang, NViet, AQZhang, DAiyar, NVBehm, DJCarballo, LHEvans, CAFries, HENagilla, RRoethke, TJXu, XYuan, CCDouglas, SANeeb, MJ Development of potent and selective small-molecule human Urotensin-II antagonists. Bioorg Med Chem Lett18:3500-3 (2008) 
 
Kappa-type opioid receptor
Name:Kappa-type opioid receptor
Type:G Protein-Coupled Receptor (GPCR)
Mol. Mass.:42648.76
Organism:Homo sapiens (Human)
Description:P41145
Residue:380
BDBM50377220
NameBDBM50377220
Synonyms:CHEMBL255509
TypeSmall organic molecule
Emp. Form.C26H29Cl2N3O3
Mol. Mass.502.433
SMILESClc1cc2OCC(=O)N(CC(=O)N3CCCC(C3CN3CCCC3)c3ccccc3)c2cc1Cl