Reaction Details
TargetGlycogen synthase kinase-3 beta
LigandBDBM50377234
Substrate/Competitorn/a
Meas. Tech.ChEMBL_479408 (CHEMBL928210)
IC50 3±n/a nM
Citation Lum, CKahl, JKessler, LKucharski, JLundström, JMiller, SNakanishi, HPei, YPryor, KRoberts, ESebo, LSullivan, RUrban, JWang, Z 2,5-Diaminopyrimidines and 3,5-disubstituted azapurines as inhibitors of glycogen synthase kinase-3 (GSK-3). Bioorg Med Chem Lett18:3578-81 (2008) 
 
Glycogen synthase kinase-3 beta
Name:Glycogen synthase kinase-3 beta
Type:Enzyme
Mol. Mass.:46756.38
Organism:Homo sapiens (Human)
Description:P49841
Residue:420
BDBM50377234
NameBDBM50377234
Synonyms:CHEMBL402902
TypeSmall organic molecule
Emp. Form.C21H23N5O5
Mol. Mass.425.4378
SMILESOC(=O)c1ccc(Nc2ncc(c(NC34CC5CC(CC(O)(C5)C3)C4)n2)[N+]([O-])=O)cc1