Reaction Details
TargetAurora kinase A
LigandBDBM50377235
Substrate/Competitorn/a
Meas. Tech.ChEMBL_479410 (CHEMBL928212)
IC50 128±n/a nM
Citation Lum, CKahl, JKessler, LKucharski, JLundström, JMiller, SNakanishi, HPei, YPryor, KRoberts, ESebo, LSullivan, RUrban, JWang, Z 2,5-Diaminopyrimidines and 3,5-disubstituted azapurines as inhibitors of glycogen synthase kinase-3 (GSK-3). Bioorg Med Chem Lett18:3578-81 (2008) 
 
Aurora kinase A
Name:Aurora kinase A
Type:Serine/threonine-protein kinase
Mol. Mass.:45830.98
Organism:Homo sapiens (Human)
Description:O14965
Residue:403
BDBM50377235
NameBDBM50377235
Synonyms:CHEMBL402541
TypeSmall organic molecule
Emp. Form.C18H14N6O3
Mol. Mass.362.3422
SMILESOC(=O)COc1ccc(Nc2ncc3nnn(-c4ccccc4)c3n2)cc1