Reaction Details
TargetGlycogen synthase kinase-3 beta
LigandBDBM50377231
Substrate/Competitorn/a
Meas. Tech.ChEMBL_479408 (CHEMBL928210)
IC50 26±n/a nM
Citation Lum, CKahl, JKessler, LKucharski, JLundström, JMiller, SNakanishi, HPei, YPryor, KRoberts, ESebo, LSullivan, RUrban, JWang, Z 2,5-Diaminopyrimidines and 3,5-disubstituted azapurines as inhibitors of glycogen synthase kinase-3 (GSK-3). Bioorg Med Chem Lett18:3578-81 (2008) 
 
Glycogen synthase kinase-3 beta
Name:Glycogen synthase kinase-3 beta
Type:Enzyme
Mol. Mass.:46756.38
Organism:Homo sapiens (Human)
Description:P49841
Residue:420
BDBM50377231
NameBDBM50377231
Synonyms:CHEMBL253748
TypeSmall organic molecule
Emp. Form.C21H23N5O4
Mol. Mass.409.4384
SMILESOC(=O)c1ccc(Nc2ncc(c(NC34CC5CC(CC(C5)C3)C4)n2)[N+]([O-])=O)cc1