Reaction Details
TargetGlycogen synthase kinase-3 alpha
LigandBDBM50377245
Substrate/Competitorn/a
Meas. Tech.ChEMBL_479409 (CHEMBL928211)
IC50 1499±n/a nM
Citation Lum, CKahl, JKessler, LKucharski, JLundström, JMiller, SNakanishi, HPei, YPryor, KRoberts, ESebo, LSullivan, RUrban, JWang, Z 2,5-Diaminopyrimidines and 3,5-disubstituted azapurines as inhibitors of glycogen synthase kinase-3 (GSK-3). Bioorg Med Chem Lett18:3578-81 (2008) 
 
Glycogen synthase kinase-3 alpha
Name:Glycogen synthase kinase-3 alpha
Type:Enzyme
Mol. Mass.:50991.79
Organism:Homo sapiens (Human)
Description:P49840
Residue:483
BDBM50377245
NameBDBM50377245
Synonyms:CHEMBL254587
TypeSmall organic molecule
Emp. Form.C20H29FN4O2
Mol. Mass.376.4683
SMILESO[C@H]1CC[C@@H](CC1)Nc1ncc(F)c(NC23CC4CC(CC(O)(C4)C2)C3)n1