Reaction Details
TargetGlycogen synthase kinase-3 alpha
LigandBDBM50377249
Substrate/Competitorn/a
Meas. Tech.ChEMBL_479409 (CHEMBL928211)
IC50 444±n/a nM
Citation Lum, CKahl, JKessler, LKucharski, JLundström, JMiller, SNakanishi, HPei, YPryor, KRoberts, ESebo, LSullivan, RUrban, JWang, Z 2,5-Diaminopyrimidines and 3,5-disubstituted azapurines as inhibitors of glycogen synthase kinase-3 (GSK-3). Bioorg Med Chem Lett18:3578-81 (2008) 
 
Glycogen synthase kinase-3 alpha
Name:Glycogen synthase kinase-3 alpha
Type:Enzyme
Mol. Mass.:50991.79
Organism:Homo sapiens (Human)
Description:P49840
Residue:483
BDBM50377249
NameBDBM50377249
Synonyms:CHEMBL254155
TypeSmall organic molecule
Emp. Form.C20H28N6O2
Mol. Mass.384.4753
SMILESO[C@H]1CC[C@@H](CC1)Nc1ncc2nnn(c2n1)C12CC3CC(CC(O)(C3)C1)C2