Reaction Details
TargetGlycogen synthase kinase-3 beta
LigandBDBM50377254
Substrate/Competitorn/a
Meas. Tech.ChEMBL_479408 (CHEMBL928210)
IC50 4170±n/a nM
Citation Lum, CKahl, JKessler, LKucharski, JLundström, JMiller, SNakanishi, HPei, YPryor, KRoberts, ESebo, LSullivan, RUrban, JWang, Z 2,5-Diaminopyrimidines and 3,5-disubstituted azapurines as inhibitors of glycogen synthase kinase-3 (GSK-3). Bioorg Med Chem Lett18:3578-81 (2008) 
 
Glycogen synthase kinase-3 beta
Name:Glycogen synthase kinase-3 beta
Type:Enzyme
Mol. Mass.:46756.38
Organism:Homo sapiens (Human)
Description:P49841
Residue:420
BDBM50377254
NameBDBM50377254
Synonyms:CHEMBL256307
TypeSmall organic molecule
Emp. Form.C17H13FN4O2
Mol. Mass.324.3091
SMILESOC(=O)c1ccc(Nc2ncc(F)c(Nc3ccccc3)n2)cc1