Reaction Details
TargetGlycogen synthase kinase-3 alpha
LigandBDBM50377256
Substrate/Competitorn/a
Meas. Tech.ChEMBL_479409 (CHEMBL928211)
IC50 1870±n/a nM
Citation Lum, CKahl, JKessler, LKucharski, JLundström, JMiller, SNakanishi, HPei, YPryor, KRoberts, ESebo, LSullivan, RUrban, JWang, Z 2,5-Diaminopyrimidines and 3,5-disubstituted azapurines as inhibitors of glycogen synthase kinase-3 (GSK-3). Bioorg Med Chem Lett18:3578-81 (2008) 
 
Glycogen synthase kinase-3 alpha
Name:Glycogen synthase kinase-3 alpha
Type:Enzyme
Mol. Mass.:50991.79
Organism:Homo sapiens (Human)
Description:P49840
Residue:483
BDBM50377256
NameBDBM50377256
Synonyms:CHEMBL256987
TypeSmall organic molecule
Emp. Form.C22H17N5O2
Mol. Mass.383.4027
SMILESOC(=O)c1ccc(Nc2ncc(c(Nc3ccccc3)n2)-c2ccncc2)cc1