Reaction Details
TargetAurora kinase A
LigandBDBM50377230
Substrate/Competitorn/a
Meas. Tech.ChEMBL_479410 (CHEMBL928212)
IC50 910±n/a nM
Citation Lum, CKahl, JKessler, LKucharski, JLundström, JMiller, SNakanishi, HPei, YPryor, KRoberts, ESebo, LSullivan, RUrban, JWang, Z 2,5-Diaminopyrimidines and 3,5-disubstituted azapurines as inhibitors of glycogen synthase kinase-3 (GSK-3). Bioorg Med Chem Lett18:3578-81 (2008) 
 
Aurora kinase A
Name:Aurora kinase A
Type:Serine/threonine-protein kinase
Mol. Mass.:45830.98
Organism:Homo sapiens (Human)
Description:O14965
Residue:403
BDBM50377230
NameBDBM50377230
Synonyms:CHEMBL257577
TypeSmall organic molecule
Emp. Form.C21H22N6O2
Mol. Mass.390.4384
SMILESOC(=O)c1ccc(Nc2ncc3nnn(c3n2)C23CC4CC(CC(C4)C2)C3)cc1