Reaction Details
TargetEpidermal growth factor receptor
LigandBDBM50377281
Substrate/Competitorn/a
Meas. Tech.ChEMBL_479448 (CHEMBL934832)
IC50 33±n/a nM
Citation Xu, GSearle, LLHughes, TVBeck, AKConnolly, PJAbad, MCNeeper, MPStruble, GTSpringer, BAEmanuel, SLGruninger, RHPandey, NAdams, MMoreno-Mazza, SFuentes-Pesquera, ARMiddleton, SAGreenberger, LM Discovery of novel 4-amino-6-arylaminopyrimidine-5-carbaldehyde oximes as dual inhibitors of EGFR and ErbB-2 protein tyrosine kinases. Bioorg Med Chem Lett18:3495-9 (2008) 
 
Epidermal growth factor receptor
Name:Epidermal growth factor receptor
Type:Receptor Kinase Domain
Mol. Mass.:134279.59
Organism:Homo sapiens (Human)
Description:P00533
Residue:1210
BDBM50377281
NameBDBM50377281
Synonyms:CHEMBL256529
TypeSmall organic molecule
Emp. Form.C19H16ClF2N5O2
Mol. Mass.419.812
SMILESCO\N=C\c1c(N)ncnc1Nc1ccc(OCc2cc(F)cc(F)c2)c(Cl)c1