Reaction Details
TargetEpidermal growth factor receptor
LigandBDBM50377283
Substrate/Competitorn/a
Meas. Tech.ChEMBL_479448 (CHEMBL934832)
IC50 23±n/a nM
Citation Xu, GSearle, LLHughes, TVBeck, AKConnolly, PJAbad, MCNeeper, MPStruble, GTSpringer, BAEmanuel, SLGruninger, RHPandey, NAdams, MMoreno-Mazza, SFuentes-Pesquera, ARMiddleton, SAGreenberger, LM Discovery of novel 4-amino-6-arylaminopyrimidine-5-carbaldehyde oximes as dual inhibitors of EGFR and ErbB-2 protein tyrosine kinases. Bioorg Med Chem Lett18:3495-9 (2008) 
 
Epidermal growth factor receptor
Name:Epidermal growth factor receptor
Type:Receptor Kinase Domain
Mol. Mass.:134279.59
Organism:Homo sapiens (Human)
Description:P00533
Residue:1210
BDBM50377283
NameBDBM50377283
Synonyms:CHEMBL255656
TypeSmall organic molecule
Emp. Form.C20H18ClN7O
Mol. Mass.407.856
SMILESCO\N=C\c1c(N)ncnc1Nc1ccc2n(Cc3cccc(Cl)c3)ncc2c1