Reaction Details
TargetReceptor tyrosine-protein kinase erbB-2
LigandBDBM50377276
Substrate/Competitorn/a
Meas. Tech.ChEMBL_479449 (CHEMBL934833)
IC50 18±n/a nM
Citation Xu, GSearle, LLHughes, TVBeck, AKConnolly, PJAbad, MCNeeper, MPStruble, GTSpringer, BAEmanuel, SLGruninger, RHPandey, NAdams, MMoreno-Mazza, SFuentes-Pesquera, ARMiddleton, SAGreenberger, LM Discovery of novel 4-amino-6-arylaminopyrimidine-5-carbaldehyde oximes as dual inhibitors of EGFR and ErbB-2 protein tyrosine kinases. Bioorg Med Chem Lett18:3495-9 (2008) 
 
Receptor tyrosine-protein kinase erbB-2
Name:Receptor tyrosine-protein kinase erbB-2
Type:n/a
Mol. Mass.:137894.47
Organism:Homo sapiens (Human)
Description:P04626
Residue:1255
BDBM50377276
NameBDBM50377276
Synonyms:CHEMBL256297
TypeSmall organic molecule
Emp. Form.C19H17ClFN5O2
Mol. Mass.401.822
SMILESCO\N=C\c1c(N)ncnc1Nc1ccc(OCc2cccc(F)c2)c(Cl)c1