Reaction Details
TargetReceptor tyrosine-protein kinase erbB-2
LigandBDBM50377282
Substrate/Competitorn/a
Meas. Tech.ChEMBL_479449 (CHEMBL934833)
IC50 44±n/a nM
Citation Xu, GSearle, LLHughes, TVBeck, AKConnolly, PJAbad, MCNeeper, MPStruble, GTSpringer, BAEmanuel, SLGruninger, RHPandey, NAdams, MMoreno-Mazza, SFuentes-Pesquera, ARMiddleton, SAGreenberger, LM Discovery of novel 4-amino-6-arylaminopyrimidine-5-carbaldehyde oximes as dual inhibitors of EGFR and ErbB-2 protein tyrosine kinases. Bioorg Med Chem Lett18:3495-9 (2008) 
 
Receptor tyrosine-protein kinase erbB-2
Name:Receptor tyrosine-protein kinase erbB-2
Type:n/a
Mol. Mass.:137894.47
Organism:Homo sapiens (Human)
Description:P04626
Residue:1255
BDBM50377282
NameBDBM50377282
Synonyms:CHEMBL255865
TypeSmall organic molecule
Emp. Form.C21H18N8O
Mol. Mass.398.4206
SMILESCO\N=C\c1c(N)ncnc1Nc1ccc2n(Cc3cccc(c3)C#N)ncc2c1