Reaction Details
TargetGlucocorticoid receptor
LigandBDBM19190
Substrate/Competitorn/a
Meas. Tech.ChEMBL_479547 (CHEMBL931543)
IC50 4.1±n/a nM
Citation Roach, SLHiguchi, RIAdams, MELiu, YKaranewsky, DSMarschke, KBMais, DEMiner, JNZhi, L Discovery of nonsteroidal glucocorticoid receptor ligands based on 6-indole-1,2,3,4-tetrahydroquinolines. Bioorg Med Chem Lett18:3504-8 (2008) 
 
Glucocorticoid receptor
Name:Glucocorticoid receptor
Type:Enzyme
Mol. Mass.:85656.87
Organism:Homo sapiens (Human)
Description:P04150
Residue:777
BDBM19190
NameBDBM19190
Synonyms:(1S,2R,10S,11S,14R,15S,17S)-14,17-dihydroxy-14-(2-hydroxyacetyl)-2,15-dimethyltetracyclo[8.7.0.0^{2,7}.0^{11,15}]heptadeca-3,6-dien-5-one Delta-Cortef Prednisolone | US10196374, Prednisolone
TypeSteroid
Emp. Form.C21H28O5
Mol. Mass.360.444
SMILES[H][C@@]12CC[C@](O)(C(=O)CO)[C@@]1(C)C[C@H](O)[C@@]1([H])[C@@]2([H])CCC2=CC(=O)C=C[C@]12C