Reaction Details
TargetGlucocorticoid receptor
LigandBDBM50334048
Substrate/Competitorn/a
Meas. Tech.ChEMBL_479540 (CHEMBL931536)
Ki 0.600±n/a nM
Citation Roach, SLHiguchi, RIAdams, MELiu, YKaranewsky, DSMarschke, KBMais, DEMiner, JNZhi, L Discovery of nonsteroidal glucocorticoid receptor ligands based on 6-indole-1,2,3,4-tetrahydroquinolines. Bioorg Med Chem Lett18:3504-8 (2008) 
 
Glucocorticoid receptor
Name:Glucocorticoid receptor
Type:Enzyme
Mol. Mass.:85656.87
Organism:Homo sapiens (Human)
Description:P04150
Residue:777
BDBM50334048
NameBDBM50334048
Synonyms:(-)-5-chloro-6-(1H-indol-7-yl)-2,2,4,8-tetramethyl-1,2,3,4-tetrahydroquinoline CHEMBL258191 | racemic-5-chloro-6-(1H-indol-7-yl)-2,2,4,8-tetramethyl-1,2,3,4-tetrahydroquinoline
TypeSmall organic molecule
Emp. Form.C21H23ClN2
Mol. Mass.338.874
SMILESCC1CC(C)(C)Nc2c(C)cc(c(Cl)c12)-c1cccc2cc[nH]c12