Reaction Details
TargetVascular endothelial growth factor receptor 2
LigandBDBM50377353
Substrate/Competitorn/a
Meas. Tech.ChEMBL_479553 (CHEMBL929417)
IC50 25±n/a nM
Citation Ruel, RThibeault, CL'Heureux, AMartel, ACai, ZWWei, DQian, LBarrish, JCMathur, AD'Arienzo, CHunt, JTKamath, AMarathe, PZhang, YDerbin, GWautlet, BMortillo, SJeyaseelan, RHenley, BTejwani, RBhide, RSTrainor, GLFargnoli, JLombardo, LJ Discovery and preclinical studies of 5-isopropyl-6-(5-methyl-1,3,4-oxadiazol-2-yl)-N-(2-methyl-1H-pyrrolo[2,3-b]pyridin-5-yl)pyrrolo[2,1-f][1,2,4]triazin-4-amine (BMS-645737), an in vivo active potent VEGFR-2 inhibitor. Bioorg Med Chem Lett18:2985-9 (2008) 
 
Vascular endothelial growth factor receptor 2
Name:Vascular endothelial growth factor receptor 2
Type:Receptor Tyrosine Kinase
Mol. Mass.:151510.97
Organism:Homo sapiens (Human)
Description:P35968
Residue:1356
BDBM50377353
NameBDBM50377353
Synonyms:CHEMBL409442
TypeSmall organic molecule
Emp. Form.C20H21N9O
Mol. Mass.403.4404
SMILESCNc1nnc(o1)-c1cn2ncnc(Nc3cnc4[nH]c(C)cc4c3)c2c1C(C)C