Reaction Details
TargetVascular endothelial growth factor receptor 2
LigandBDBM50377362
Substrate/Competitorn/a
Meas. Tech.ChEMBL_479553 (CHEMBL929417)
IC50 121±n/a nM
Citation Ruel, RThibeault, CL'Heureux, AMartel, ACai, ZWWei, DQian, LBarrish, JCMathur, AD'Arienzo, CHunt, JTKamath, AMarathe, PZhang, YDerbin, GWautlet, BMortillo, SJeyaseelan, RHenley, BTejwani, RBhide, RSTrainor, GLFargnoli, JLombardo, LJ Discovery and preclinical studies of 5-isopropyl-6-(5-methyl-1,3,4-oxadiazol-2-yl)-N-(2-methyl-1H-pyrrolo[2,3-b]pyridin-5-yl)pyrrolo[2,1-f][1,2,4]triazin-4-amine (BMS-645737), an in vivo active potent VEGFR-2 inhibitor. Bioorg Med Chem Lett18:2985-9 (2008) 
 
Vascular endothelial growth factor receptor 2
Name:Vascular endothelial growth factor receptor 2
Type:Receptor Tyrosine Kinase
Mol. Mass.:151510.97
Organism:Homo sapiens (Human)
Description:P35968
Residue:1356
BDBM50377362
NameBDBM50377362
Synonyms:CHEMBL412082
TypeSmall organic molecule
Emp. Form.C16H14N6O2
Mol. Mass.322.3214
SMILESCOC(=O)c1cn2ncnc(Nc3cnc4[nH]ccc4c3)c2c1C