Reaction Details
TargetHistone deacetylase 4
LigandBDBM50377384
Substrate/Competitorn/a
Meas. Tech.ChEMBL_479642 (CHEMBL921443)
IC50 3160±n/a nM
Citation Nakao, YNarazaki, GHoshino, TMaeda, SYoshida, MMaejima, HYamashita, JK Evaluation of antiangiogenic activity of azumamides by the in vitro vascular organization model using mouse induced pluripotent stem (iPS) cells. Bioorg Med Chem Lett18:2982-4 (2008) 
 
Histone deacetylase 4
Name:Histone deacetylase 4
Type:Enzyme
Mol. Mass.:119049.39
Organism:Homo sapiens (Human)
Description:P56524
Residue:1084
BDBM50377384
NameBDBM50377384
Synonyms:AZUMAMIDE C
TypeSmall organic molecule
Emp. Form.C27H38N4O7
Mol. Mass.530.6132
SMILESCC(C)[C@H]1NC(=O)[C@@H](C)[C@@H](CC=CCCC(O)=O)NC(=O)[C@@H](Cc2ccc(O)cc2)NC(=O)[C@@H](C)NC1=O