Reaction Details
TargetAlpha-2A adrenergic receptor
LigandBDBM50377391
Substrate/Competitorn/a
Meas. Tech.ChEMBL_479655 (CHEMBL922403)
EC50 27±n/a nM
Citation Whitlock, GAConlon, KMcMurray, GRoberts, LRStobie, AThurlow, RJ Novel 2-imidazoles as potent and selective alpha1A adrenoceptor partial agonists. Bioorg Med Chem Lett18:2930-4 (2008) 
 
Alpha-2A adrenergic receptor
Name:Alpha-2A adrenergic receptor
Type:Enzyme
Mol. Mass.:48979.91
Organism:Homo sapiens (Human)
Description:P08913
Residue:450
BDBM50377391
NameBDBM50377391
Synonyms:CHEMBL402388
TypeSmall organic molecule
Emp. Form.C13H14N2O
Mol. Mass.214.2631
SMILESCOc1cccc2C(CCc12)c1ncc[nH]1