Reaction Details
TargetAndrogen receptor
LigandBDBM50377415
Substrate/Competitorn/a
Meas. Tech.ChEMBL_479690 (CHEMBL933554)
Ki 2.4±n/a nM
Citation Long, YOHiguchi, RICaferro, TRLau, TLWu, MCummings, MLMartinborough, EAMarschke, KBChang, WYLópez, FJKaranewsky, DSZhi, L Selective androgen receptor modulators based on a series of 7H-[1,4]oxazino[3,2-g]quinolin-7-ones with improved in vivo activity. Bioorg Med Chem Lett18:2967-71 (2008) 
 
Androgen receptor
Name:Androgen receptor
Type:Receptor
Mol. Mass.:99185.27
Organism:Homo sapiens (Human)
Description:CHO cells were stably transfected with human AR gene.
Residue:920
BDBM50377415
NameBDBM50377415
Synonyms:CHEMBL404483
TypeSmall organic molecule
Emp. Form.C17H16F6N2O2S
Mol. Mass.426.377
SMILESCSCC[C@@H]1COc2cc3[nH]c(=O)cc(c3cc2N1CC(F)(F)F)C(F)(F)F