Reaction Details
TargetCarboxylic ester hydrolase
LigandBDBM50377435
Substrate/Competitorn/a
Meas. Tech.ChEMBL_479695 (CHEMBL933559)
IC50 12.7±n/a nM
Citation Fang, LKraus, BLehmann, JHeilmann, JZhang, YDecker, M Design and synthesis of tacrine-ferulic acid hybrids as multi-potent anti-Alzheimer drug candidates. Bioorg Med Chem Lett18:2905-9 (2008) 
 
Carboxylic ester hydrolase
Name:Carboxylic ester hydrolase
Type:Protein
Mol. Mass.:68842.83
Organism:Equus caballus (Horse)
Description:Q9N1N9
Residue:602
BDBM50377435
NameBDBM50377435
Synonyms:CHEMBL256919
TypeSmall organic molecule
Emp. Form.C31H39N3O3
Mol. Mass.501.6597
SMILESCOc1cc(\C=C\C(=O)NCCCCCCCCNc2c3CCCCc3nc3ccccc23)ccc1O