Reaction Details
TargetAdenosine receptor A2a
LigandBDBM50377492
Substrate/Competitorn/a
Meas. Tech.ChEMBL_479708 (CHEMBL933572)
EC50>10000±n/a nM
Citation Gillespie, RJCliffe, IADawson, CEDourish, CTGaur, SGiles, PRJordan, AMKnight, ARLawrence, ALerpiniere, JMisra, APratt, RMTodd, RSUpton, RWeiss, SMWilliamson, DS Antagonists of the human adenosine A2A receptor. Part 2: Design and synthesis of 4-arylthieno[3,2-d]pyrimidine derivatives. Bioorg Med Chem Lett18:2920-3 (2008) 
 
Adenosine receptor A2a
Name:Adenosine receptor A2a
Type:G Protein-Coupled Receptor (GPCR)
Mol. Mass.:44716.46
Organism:Homo sapiens (Human)
Description:P29274
Residue:412
BDBM50377492
NameBDBM50377492
Synonyms:CHEMBL407650
TypeSmall organic molecule
Emp. Form.C11H9N3S2
Mol. Mass.247.339
SMILESCCc1nc(-c2nccs2)c2sccc2n1