Reaction Details
TargetAdenosine receptor A2a
LigandBDBM50377558
Substrate/Competitorn/a
Meas. Tech.ChEMBL_479713 (CHEMBL921473)
Ki 1±n/a nM
Citation Gillespie, RJCliffe, IADawson, CEDourish, CTGaur, SJordan, AMKnight, ARLerpiniere, JMisra, APratt, RMRoffey, JStratton, GCUpton, RWeiss, SMWilliamson, DS Antagonists of the human adenosine A2A receptor. Part 3: Design and synthesis of pyrazolo[3,4-d]pyrimidines, pyrrolo[2,3-d]pyrimidines and 6-arylpurines. Bioorg Med Chem Lett18:2924-9 (2008) 
 
Adenosine receptor A2a
Name:Adenosine receptor A2a
Type:G Protein-Coupled Receptor (GPCR)
Mol. Mass.:44716.46
Organism:Homo sapiens (Human)
Description:P29274
Residue:412
BDBM50377558
NameBDBM50377558
Synonyms:CHEMBL429144
TypeSmall organic molecule
Emp. Form.C17H13FN6O2
Mol. Mass.352.3225
SMILESNc1nc(-c2ccco2)c2ncn(C(=O)NCc3ccc(F)cc3)c2n1