Reaction Details
TargetAdenosine receptor A2a
LigandBDBM50165069
Substrate/Competitorn/a
Meas. Tech.ChEMBL_479713 (CHEMBL921473)
Ki 3±n/a nM
Citation Gillespie, RJCliffe, IADawson, CEDourish, CTGaur, SJordan, AMKnight, ARLerpiniere, JMisra, APratt, RMRoffey, JStratton, GCUpton, RWeiss, SMWilliamson, DS Antagonists of the human adenosine A2A receptor. Part 3: Design and synthesis of pyrazolo[3,4-d]pyrimidines, pyrrolo[2,3-d]pyrimidines and 6-arylpurines. Bioorg Med Chem Lett18:2924-9 (2008) 
 
Adenosine receptor A2a
Name:Adenosine receptor A2a
Type:G Protein-Coupled Receptor (GPCR)
Mol. Mass.:44716.46
Organism:Homo sapiens (Human)
Description:P29274
Residue:412
BDBM50165069
NameBDBM50165069
Synonyms:9-(2,6-Difluoro-benzyl)-6-furan-2-yl-9H-purin-2-ylamine CHEMBL371615
TypeSmall organic molecule
Emp. Form.C16H11F2N5O
Mol. Mass.327.2882
SMILESNc1nc(-c2ccco2)c2ncn(Cc3c(F)cccc3F)c2n1