Reaction Details
TargetPlasmepsin II
LigandBDBM50377588
Substrate/Competitorn/a
Meas. Tech.ChEMBL_479736 (CHEMBL929233)
IC50 0.13±n/a nM
Citation Azim, MKAhmed, WKhan, IARao, NAKhan, KM Identification of acridinyl hydrazides as potent aspartic protease inhibitors. Bioorg Med Chem Lett18:3011-5 (2008) 
 
Plasmepsin II
Name:Plasmepsin II
Type:Enzyme
Mol. Mass.:51482.09
Organism:Plasmodium falciparum
Description:P46925
Residue:453
BDBM50377588
NameBDBM50377588
Synonyms:CHEMBL257594
TypeSmall organic molecule
Emp. Form.C22H19N3O2
Mol. Mass.357.4052
SMILESCc1ccc2c(NNC(=O)c3ccccc3O)c3ccccc3nc2c1C