Reaction Details
TargetCathepsin B
LigandBDBM50377598
Substrate/Competitorn/a
Meas. Tech.ChEMBL_479741 (CHEMBL929238)
IC50 300±n/a nM
Citation Mallari, JPShelat, AKosinski, ACaffrey, CRConnelly, MZhu, FMcKerrow, JHGuy, RK Discovery of trypanocidal thiosemicarbazone inhibitors of rhodesain and TbcatB. Bioorg Med Chem Lett18:2883-5 (2008) 
 
Cathepsin B
Name:Cathepsin B
Type:Enzyme
Mol. Mass.:37819.69
Organism:Homo sapiens (Human)
Description:gi_63102437
Residue:339
BDBM50377598
NameBDBM50377598
Synonyms:CHEMBL260921
TypeSmall organic molecule
Emp. Form.C14H9F6N3S2
Mol. Mass.397.362
SMILESNC(=S)NN=C(c1cccs1)c1cc(cc(c1)C(F)(F)F)C(F)(F)F